JADE sun4 build errors

Subject: JADE sun4 build errors
From: Karl Critz <kcritz@xxxxxxxxxxxxx>
Date: Thu, 19 Mar 1998 13:55:25 -0500
Having some trouble building JADE for sol4.  Anyone have
any idea how to solve this?



build on SunOS4.1.4 with gcc,libg++2.7.2, virgin build.

c++ -fno-implicit-templates -O2 -ansi  -Wall -Wno-reorder -Wwrite-strings
-Wpointer-arith -Wnested-externs -Woverloaded-virtual -Wbad-function-cast
-I. -I./../include -I./../grove -I./../spgrove -I./../style -DSP_HAVE_BOOL
-DSP_ANSI_CLASS_INST -DSP_MULTI_BYTE -Dsig_atomic_t=int  -o jade jade.o
SgmlFOTBuilder.o RtfFOTBuilder.o HtmlFOTBuilder.o TeXFOTBuilder.o
TransformFOTBuilder.o  ../style/libstyle.a ../spgrove/libspgrove.a
../grove/libgrove.a ../lib/libsp.a -lnsl -lg++ -liostream -lc
collect2: ld returned 2 exit status
ld: Undefined symbol 
   lseek(int, long, int)
   read(int, void *, unsigned long)
   write(int, void const *, unsigned long)
gmake[2]: *** [jade] Error 1
gmake[2]: Leaving directory `/tmp_mnt/src/net/other/jade/jade1.0.1/jade'
gmake[1]: *** [jade] Error 1
gmake[1]: Leaving directory `/tmp_mnt/src/net/other/jade/jade1.0.1'
gmake: *** [all] Error 1

Karl Critz                                 The Mathworks Inc           
mailto:kcritz@xxxxxxxxxxxxx        http://www.mathworks.com/    
voice: 508.647.7000 x7768                  24 Prime Park Way
fax:   508.647.7002                          Natick MA 01760

 DSSSList info and archive:  http://www.mulberrytech.com/dsssl/dssslist

Current Thread
  • JADE sun4 build errors
    • Karl Critz - from mail1.ability.netby web4.ability.net (8.8.5/8.6.12) with ESMTP id NAA23503Thu, 19 Mar 1998 13:57:44 -0500 (EST) <=