unable to build jade 1.2

Subject: unable to build jade 1.2
From: Altaf Udaipurwala <Altaf@xxxxxxxxxx>
Date: Fri, 1 Sep 2000 16:10:58 -0400
when try to run make command, now I get this error

../include/StringOf.h:40: `String<short unsigned int>::begin()' has already
been declared in `String<short unsigned int>'
make[2]: *** [CharsetInfo.lo] Error 1
make[2]: Leaving directory `/stats/usr/local/gnu/bin/jade/jade-1.2.1/lib'
make[1]: *** [lib] Error 2
make[1]: Leaving directory `/stats/usr/local/gnu/bin/jade/jade-1.2.1'
make: *** [all] Error 2
# Makefile.dist.make mrproper
Makefile.dist.make: not found

pls help



 DSSSList info and archive:  http://www.mulberrytech.com/dsssl/dssslist

Current Thread